Target
Sodium-dependent dopamine transporter
Ligand
BDBM30130
Substrate
Meas. Tech.
ChEBML_131451
Ki
11±n/a nM
Citation
 Maryanoff, BEVaught, JLShank, RPMcComsey, DFCostanzo, MJNortey, SO Pyrroloisoquinoline antidepressants. 3. A focus on serotonin. J Med Chem 33:2793-7 (1990)  
Target
Name:
Sodium-dependent dopamine transporter
Synonyms:
DA transporter Dat1 SC6A3_MOUSE Sodium-dependent dopamine transporter | Solute carrier family 6 member 3
Type:
Enzyme Catalytic Domain
Mol. Mass.:
68809.06
Organism:
MOUSE
Description:
Dopamine Transporter SLC6A3 MOUSE::Q61327
Residue:
619
  
Inhibitor
Name:
BDBM30130
Synonyms:
CHEMBL1201082 Fluoxetin Prozac cid_62857
Type:
Small organic molecule
Emp. Form.:
C17H18F3NO
Mol. Mass.:
309.3261
SMILES:
CNCCC(Oc1ccc(cc1)C(F)(F)F)c1ccccc1
: