Target
Sodium-dependent dopamine transporter
Ligand
BDBM50014233
Substrate
Meas. Tech.
ChEMBL_131453 (CHEMBL740208)
Ki
9.7±n/a nM
Citation
 Maryanoff, BEVaught, JLShank, RPMcComsey, DFCostanzo, MJNortey, SO Pyrroloisoquinoline antidepressants. 3. A focus on serotonin. J Med Chem 33:2793-7 (1990)  
Target
Name:
Sodium-dependent dopamine transporter
Synonyms:
DA transporter Dat1 SC6A3_MOUSE Sodium-dependent dopamine transporter | Solute carrier family 6 member 3
Type:
Enzyme Catalytic Domain
Mol. Mass.:
68809.06
Organism:
MOUSE
Description:
Dopamine Transporter SLC6A3 MOUSE::Q61327
Residue:
619
  
Inhibitor
Name:
BDBM50014233
Synonyms:
6-(2-Chloro-phenyl)-1,2,3,5,6,10b-hexahydro-pyrrolo[2,1-a]isoquinoline | CHEMBL94535
Type:
Small organic molecule
Emp. Form.:
C18H18ClN
Mol. Mass.:
283.795
SMILES:
Clc1ccccc1C1CN2CCC[C@@H]2c2ccccc12
: