Target
Beta-2 adrenergic receptor
Ligand
BDBM50367951
Substrate
Meas. Tech.
ChEBML_37835
IC50
50000±n/a nM
Citation
 Lis, RMorgan, TKMarisca, AJGomez, RPLind, JMDavey, DDPhillips, GBSullivan, ME Synthesis of novel (aryloxy)propanolamines and related compounds possessing both class II and class III antiarrhythmic activity. J Med Chem 33:2883-91 (1990)  
Target
Name:
Beta-2 adrenergic receptor
Synonyms:
ADRB2 | ADRB2_CANLF
Type:
PROTEIN
Mol. Mass.:
46593.67
Organism:
Canis familiaris
Description:
ChEMBL_56504
Residue:
415
  
Inhibitor
Name:
BDBM50367951
Synonyms:
CHEMBL1193886
Type:
Small organic molecule
Emp. Form.:
C21H26N4O5S
Mol. Mass.:
446.52
SMILES:
CS(=O)(=O)Nc1ccc(OC[C@@H](O)CNCCOc2ccc(cc2)-n2ccnc2)cc1
: