Target
Beta-2 adrenergic receptor
Ligand
BDBM50010834
Substrate
Meas. Tech.
ChEBML_37835
IC50
280±n/a nM
Citation
 Lis, RMorgan, TKMarisca, AJGomez, RPLind, JMDavey, DDPhillips, GBSullivan, ME Synthesis of novel (aryloxy)propanolamines and related compounds possessing both class II and class III antiarrhythmic activity. J Med Chem 33:2883-91 (1990)  
Target
Name:
Beta-2 adrenergic receptor
Synonyms:
ADRB2 | ADRB2_CANLF
Type:
PROTEIN
Mol. Mass.:
46593.67
Organism:
Canis familiaris
Description:
ChEMBL_56504
Residue:
415
  
Inhibitor
Name:
BDBM50010834
Synonyms:
1-{2-[4-(3H-Imidazol-1-yl)-phenoxy]-ethylamino}-3-phenoxy-propan-2-ol | CHEMBL98975
Type:
Small organic molecule
Emp. Form.:
C20H23N3O3
Mol. Mass.:
353.4149
SMILES:
OC(CNCCOc1ccc(cc1)-n1ccnc1)COc1ccccc1
: