Target
Beta-1/Beta-2/Beta-3 adrenergic receptor
Ligand
BDBM50228547
Substrate
Meas. Tech.
ChEMBL_38285 (CHEMBL647668)
IC50
7000000±n/a nM
Citation
 Lis, RMorgan, TKMarisca, AJGomez, RPLind, JMDavey, DDPhillips, GBSullivan, ME Synthesis of novel (aryloxy)propanolamines and related compounds possessing both class II and class III antiarrhythmic activity. J Med Chem 33:2883-91 (1990)  
Target
Name:
Beta-1/Beta-2/Beta-3 adrenergic receptor
Synonyms:
Adrenergic receptor beta
Type:
Mol. Mass.:
Description:
ASSAY_ID of ChEMBL is 305577
Components:
This complex has 3 components.
Component 1
Name:
Beta-2 adrenergic receptor
Synonyms:
ADRB2 ADRB2_HUMAN Beta-2 adrenoceptor | Beta-2 adrenoreceptor
Type:
Mol. Mass.:
46461.69
Organism:
Homo sapiens (Human)
Description:
P07550
Residue:
413
  
Component 2
Name:
Beta-1 adrenergic receptor
Synonyms:
ADRB1 ADRB1_HUMAN Beta-1 adrenoceptor | adrenergic Beta1
Type:
G Protein-Coupled Receptor (GPCR)
Mol. Mass.:
51338.40
Organism:
Homo sapiens (Human)
Description:
P08588
Residue:
477
  
Component 3
Name:
Beta-3 adrenergic receptor
Synonyms:
ADRB3 ADRB3_HUMAN Beta-2 adrenergic receptor and beta-3 adrenergic receptor Beta-3 adrenoreceptor | adrenergic Beta3
Type:
G Protein-Coupled Receptor (GPCR)
Mol. Mass.:
43534.88
Organism:
Homo sapiens (Human)
Description:
Residue:
408
  
Inhibitor
Name:
BDBM50228547
Synonyms:
Sematilide
Type:
Small organic molecule
Emp. Form.:
C14H23N3O3S
Mol. Mass.:
313.416
SMILES:
CCN(CC)CCNC(=O)c1ccc(NS(C)(=O)=O)cc1
: