Target
Beta-1 adrenergic receptor
Ligand
BDBM50010842
Substrate
Meas. Tech.
ChEBML_56503
IC50
3300±n/a nM
Citation
 Lis, RMorgan, TKMarisca, AJGomez, RPLind, JMDavey, DDPhillips, GBSullivan, ME Synthesis of novel (aryloxy)propanolamines and related compounds possessing both class II and class III antiarrhythmic activity. J Med Chem 33:2883-91 (1990)  
Target
Name:
Beta-1 adrenergic receptor
Synonyms:
ADRB1 ADRB1_HUMAN Beta-1 adrenoceptor | adrenergic Beta1
Type:
G Protein-Coupled Receptor (GPCR)
Mol. Mass.:
51338.40
Organism:
Homo sapiens (Human)
Description:
P08588
Residue:
477
  
Inhibitor
Name:
BDBM50010842
Synonyms:
CHEMBL95754 | N-{4-[4-(2-Hydroxy-3-o-tolyloxy-propyl)-piperazin-1-yl]-phenyl}-methanesulfonamide
Type:
Small organic molecule
Emp. Form.:
C21H29N3O4S
Mol. Mass.:
419.538
SMILES:
Cc1ccccc1OCC(O)CN1CCN(CC1)c1ccc(NS(C)(=O)=O)cc1
: