Target
Transporter
Ligand
BDBM50010862
Substrate
Meas. Tech.
ChEBML_177401
IC50
5800±n/a nM
Citation
 Yardley, JPHusbands, GEStack, GButch, JBicksler, JMoyer, JAMuth, EAAndree, TFletcher, HJames, MN 2-Phenyl-2-(1-hydroxycycloalkyl)ethylamine derivatives: synthesis and antidepressant activity. J Med Chem 33:2899-905 (1990)  
Target
Name:
Transporter
Synonyms:
Monoamine transporters; Norepininephrine & dopamine | Norepinephrine Monoamine transporters
Type:
PROTEIN
Mol. Mass.:
66787.87
Organism:
Rattus norvegicus
Description:
ChEMBL_1463061
Residue:
597
  
Inhibitor
Name:
BDBM50010862
Synonyms:
1-[2-Dimethylamino-1-(4-methoxy-phenyl)-ethyl]-cyclopentanol (HCl) | CHEMBL100774
Type:
Small organic molecule
Emp. Form.:
C16H25NO2
Mol. Mass.:
263.3752
SMILES:
COc1ccc(cc1)C(CN(C)C)C1(O)CCCC1
: