Target
Alpha-1A adrenergic receptor
Ligand
BDBM50010872
Substrate
Meas. Tech.
ChEBML_88911
IC50
62±n/a nM
Citation
 Yardley, JPHusbands, GEStack, GButch, JBicksler, JMoyer, JAMuth, EAAndree, TFletcher, HJames, MN 2-Phenyl-2-(1-hydroxycycloalkyl)ethylamine derivatives: synthesis and antidepressant activity. J Med Chem 33:2899-905 (1990)  
Target
Name:
Alpha-1A adrenergic receptor
Synonyms:
ADA1A_RAT Adra1c Alpha-1A adrenoceptor Alpha-1C adrenergic receptor | adrenergic Alpha1A
Type:
Protein
Mol. Mass.:
51620.15
Organism:
Rattus norvegicus (Rat)
Description:
P43140
Residue:
466
  
Inhibitor
Name:
BDBM50010872
Synonyms:
1-[1-(4-Bromo-phenyl)-2-dimethylamino-ethyl]-cyclohexanol (HCl) | CHEMBL99175
Type:
Small organic molecule
Emp. Form.:
C16H24BrNO
Mol. Mass.:
326.272
SMILES:
CN(C)CC(c1ccc(Br)cc1)C1(O)CCCCC1
: