Target
Transporter
Ligand
BDBM50010878
Substrate
Meas. Tech.
ChEBML_177401
IC50
1380±n/a nM
Citation
 Yardley, JPHusbands, GEStack, GButch, JBicksler, JMoyer, JAMuth, EAAndree, TFletcher, HJames, MN 2-Phenyl-2-(1-hydroxycycloalkyl)ethylamine derivatives: synthesis and antidepressant activity. J Med Chem 33:2899-905 (1990)  
Target
Name:
Transporter
Synonyms:
Monoamine transporters; Norepininephrine & dopamine | Norepinephrine Monoamine transporters
Type:
PROTEIN
Mol. Mass.:
66787.87
Organism:
Rattus norvegicus
Description:
ChEMBL_1463061
Residue:
597
  
Inhibitor
Name:
BDBM50010878
Synonyms:
1-[1-(3,4-Dimethoxy-phenyl)-2-dimethylamino-ethyl]-cyclohexanol (HCl) | CHEMBL101819
Type:
Small organic molecule
Emp. Form.:
C18H29NO3
Mol. Mass.:
307.4278
SMILES:
COc1ccc(cc1OC)C(CN(C)C)C1(O)CCCCC1
: