Target
Sodium-dependent serotonin transporter
Ligand
BDBM50010873
Substrate
Meas. Tech.
ChEBML_177402
IC50
200±n/a nM
Citation
 Yardley, JPHusbands, GEStack, GButch, JBicksler, JMoyer, JAMuth, EAAndree, TFletcher, HJames, MN 2-Phenyl-2-(1-hydroxycycloalkyl)ethylamine derivatives: synthesis and antidepressant activity. J Med Chem 33:2899-905 (1990)  
Target
Name:
Sodium-dependent serotonin transporter
Synonyms:
5-HT Transporter 5HT transporter Anandamid membrane transporter, AMT Monoamine transporters; Norepinephrine & serotonin Slc6a4 Sodium-dependent serotonin transporter (SERT) | imipramine receptor
Type:
Multi-pass membrane protein
Mol. Mass.:
70168.43
Organism:
Rattus norvegicus (rat)
Description:
P31652
Residue:
630
  
Inhibitor
Name:
BDBM50010873
Synonyms:
1-[1-(3-Bromo-4-methoxy-phenyl)-2-dimethylamino-ethyl]-cyclohexanol (HCl) | CHEMBL99503
Type:
Small organic molecule
Emp. Form.:
C17H26BrNO2
Mol. Mass.:
356.298
SMILES:
COc1ccc(cc1Br)C(CN(C)C)C1(O)CCCCC1
: