Target
Aromatase
Ligand
BDBM50011771
Substrate
Meas. Tech.
ChEBML_50885
Ki
1±n/a nM
Citation
 Cole, PARobinson, CH Mechanism and inhibition of cytochrome P-450 aromatase. J Med Chem 33:2933-42 (1990)  
Target
Name:
Aromatase
Synonyms:
ARO1 CP19A_HUMAN CYP19 CYPXIX Cytochrome P450 19A1 Cytochrome P450-C19 (CYP19) FL cytokine receptor precursor | P-450AROM
Type:
Enzyme
Mol. Mass.:
57888.92
Organism:
Homo sapiens (Human)
Description:
P11511
Residue:
503
  
Inhibitor
Name:
BDBM50011771
Synonyms:
13-Methyl-10-thiiranyl-1,6,7,8,9,10,11,12,13,14,15,16-dodecahydro-2H-cyclopenta[a]phenanthrene-3,17-dione | CHEMBL281433
Type:
Small organic molecule
Emp. Form.:
C20H26O2S
Mol. Mass.:
330.484
SMILES:
C[C@]12CCC3C(CCC4=CC(=O)CC[C@@]34C3CS3)C1CCC2=O
: