Target
D(2) dopamine receptor
Ligand
BDBM50010891
Substrate
Meas. Tech.
ChEMBL_58367 (CHEMBL672804)
EC50
2850±n/a nM
Citation
 DeNinno, MPSchoenleber, RAsin, KEMacKenzie, RKebabian, JW (1R,3S)-1-(aminomethyl)-3,4-dihydro-5,6-dihydroxy-3-phenyl-1H-2-benzopyran: a potent and selective D1 agonist. J Med Chem 33:2948-50 (1990)  
Target
Name:
D(2) dopamine receptor
Synonyms:
DOPAMINE D2 DOPAMINE D2 Short Dopamine D2 receptor Drd2
Type:
G Protein-Coupled Receptor (GPCR)
Mol. Mass.:
50931.60
Organism:
Rattus norvegicus (rat)
Description:
P61169
Residue:
444
  
Inhibitor
Name:
BDBM50010891
Synonyms:
1-Aminomethyl-isochroman-5,6-diol CHEMBL542683 | CHEMBL99361
Type:
Small organic molecule
Emp. Form.:
C10H13NO3
Mol. Mass.:
195.2151
SMILES:
NCC1OCCc2c(O)c(O)ccc12
: