Target
Cholecystokinin receptor type A
Ligand
BDBM50007921
Substrate
Meas. Tech.
ChEBML_49583
IC50
190±n/a nM
Citation
 Shiosaki, KLin, CWKopecka, HCraig, RWagenaar, FLBianchi, BMiller, TWitte, DNadzan, AM Development of CCK-tetrapeptide analogues as potent and selective CCK-A receptor agonists. J Med Chem 33:2950-2 (1990)  
Target
Name:
Cholecystokinin receptor type A
Synonyms:
CCK-A receptor CCK1-R CCKAR_CAVPO Cholecystokinin receptor type A | Cholecystokinin-1 receptor
Type:
Mol. Mass.:
48229.77
Organism:
Cavia porcellus
Description:
Residue:
430
  
Inhibitor
Name:
BDBM50007921
Synonyms:
3-{2-[2-(2-{2-[2-(2-Amino-3-carboxy-propionylamino)-3-(4-hydroxy-phenyl)-propionylamino]-4-methylsulfanyl-butyrylamino}-acetylamino)-3-(1H-indol-3-yl)-propionylamino]-4-methylsulfanyl-butyrylamino}-N-(1-carbamoyl-2-phenyl-ethyl)-succinamic acid CHEMBL216166 | Desulfated CCK8
Type:
Small organic molecule
Emp. Form.:
C49H62N10O13S2
Mol. Mass.:
1063.206
SMILES:
CSCC[C@H](NC(=O)[C@H](Cc1ccc(O)cc1)NC(=O)[C@@H](N)CC(O)=O)C(=O)NCC(=O)N[C@@H](Cc1c[nH]c2ccccc12)C(=O)N[C@@H](CCSC)C(=O)N[C@@H](CC(O)=O)C(=O)N[C@@H](Cc1ccccc1)C(N)=O
: