Target
Kappa-type opioid receptor
Ligand
BDBM50013955
Substrate
Meas. Tech.
ChEMBL_146232 (CHEMBL755001)
Ki
1618±n/a nM
Citation
 de Costa, BRRice, KCBowen, WDThurkauf, ARothman, RBBand, LJacobson, AERadesca, LContreras, PCGray, NM Synthesis and evaluation of N-substituted cis-N-methyl-2-(1-pyrrolidinyl)cyclohexylamines as high affinity sigma receptor ligands. Identification of a new class of highly potent and selective sigma receptor probes. J Med Chem 33:3100-10 (1990)  
Target
Name:
Kappa-type opioid receptor
Synonyms:
Kappa Opioid Receptor OPRK1 Opiate Kappa 1 | mu/kappa opioid receptor
Type:
G Protein-Coupled Receptor (GPCR)
Mol. Mass.:
42744.99
Organism:
Cavia porcellus (domestic guinea pig)
Description:
P41144
Residue:
380
  
Inhibitor
Name:
BDBM50013955
Synonyms:
N-Methyl-2-naphthalen-2-yl-N-(2-pyrrolidin-1-yl-cyclohexyl)-acetamide | N-methyl-2-(naphthalen-2-yl)-N-[(2S)-2-(pyrrolidin-1-yl)cyclohexyl]acetamide
Type:
Small organic molecule
Emp. Form.:
C23H30N2O
Mol. Mass.:
350.4971
SMILES:
CN(C1CCCC[C@@H]1N1CCCC1)C(=O)Cc1ccc2ccccc2c1
: