Target
Sigma non-opioid intracellular receptor 1
Ligand
BDBM50013988
Substrate
Meas. Tech.
ChEMBL_201137 (CHEMBL803878)
IC50
1155±n/a nM
Citation
 de Costa, BRRice, KCBowen, WDThurkauf, ARothman, RBBand, LJacobson, AERadesca, LContreras, PCGray, NM Synthesis and evaluation of N-substituted cis-N-methyl-2-(1-pyrrolidinyl)cyclohexylamines as high affinity sigma receptor ligands. Identification of a new class of highly potent and selective sigma receptor probes. J Med Chem 33:3100-10 (1990)  
Target
Name:
Sigma non-opioid intracellular receptor 1
Synonyms:
Aging-associated gene 8 protein SGMR1_HUMAN SIGMAR1 SR31747-binding protein Sigma 1-type opioid receptor Sigma1R | hSigmaR1
Type:
Enzyme Catalytic Domain
Mol. Mass.:
25124.85
Organism:
Homo sapiens (Human)
Description:
Q99720
Residue:
223
  
Inhibitor
Name:
BDBM50013988
Synonyms:
N-Methyl-2-phenyl-N-(2-pyrrolidin-1-yl-cyclohexyl)-acetamide
Type:
Small organic molecule
Emp. Form.:
C19H28N2O
Mol. Mass.:
300.4384
SMILES:
CN(C1CCCC[C@@H]1N1CCCC1)C(=O)Cc1ccccc1
: