Target
Adenosine receptor A2a/A2b
Ligand
BDBM81925
Substrate
Meas. Tech.
ChEMBL_30720 (CHEMBL646486)
Ki
3.9±n/a nM
Citation
 Peet, NPLentz, NLMeng, ECDudley, MWOgden, AMDemeter, DAWeintraub, HJBey, P A novel synthesis of xanthines: support for a new binding mode for xanthines with respect to adenosine at adenosine receptors. J Med Chem 33:3127-30 (1991)  
Target
Name:
Adenosine receptor A2a/A2b
Synonyms:
Adenosine A2 receptor
Type:
Mol. Mass.:
Description:
ASSAY_ID of ChEMBL is 30560
Components:
This complex has 2 components.
Component 1
Name:
Adenosine receptor A2b
Synonyms:
AA2BR_RAT Adora2b
Type:
PROTEIN
Mol. Mass.:
36378.84
Organism:
Rattus norvegicus
Description:
ChEMBL_32934
Residue:
332
  
Component 2
Name:
Adenosine receptor A2a
Synonyms:
AA2AR_RAT Adenosine A2 receptor Adenosine Receptors A2a (A2a) Adenosine receptors A2a Rat striatal adenosine A2a receptor
Type:
G Protein-Coupled Receptor (GPCR)
Mol. Mass.:
45015.65
Organism:
Rattus norvegicus (rat)
Description:
Rat A2A receptors expressed in CHO cells.
Residue:
410
  
Inhibitor
Name:
BDBM81925
Synonyms:
8-Cyclopentyl-1,3-dimethyl-3,7-dihydro-purine-2,6-dione CAS_1917 CPT | NSC_1917
Type:
Small organic molecule
Emp. Form.:
C12H16N4O2
Mol. Mass.:
248.281
SMILES:
Cn1c2nc([nH]c2c(=O)n(C)c1=O)C1CCCC1
: