Target
Thromboxane-A synthase
Ligand
BDBM50014902
Substrate
Meas. Tech.
ChEMBL_209952 (CHEMBL820608)
IC50
25000±n/a nM
Citation
 Archibald, JLBradley, GOpalko, AWard, TJWhite, JCEnnis, CShepperson, NB Design of an antithrombotic-antihypertensive agent (Wy 27569). Synthesis and evaluation of a series of 2-heteroaryl-substituted dihydropyridines. J Med Chem 33:646-52 (1990)  
Target
Name:
Thromboxane-A synthase
Synonyms:
CYP5 Cytochrome P450 5A1 TBXAS1 TXA synthase TXS Thromboxane A2 Synthase (P450 TxA2) Thromboxane prostanoid Thromboxane-A synthase
Type:
Enzyme
Mol. Mass.:
60524.67
Organism:
Homo sapiens (Human)
Description:
P24557
Residue:
533
  
Inhibitor
Name:
BDBM50014902
Synonyms:
4-(2-Difluoromethoxy-phenyl)-2-imidazol-1-ylmethyl-6-methyl-1,4-dihydro-pyridine-3,5-dicarboxylic acid 5-ethyl ester 3-methyl ester : (succinate) | CHEMBL345586
Type:
Small organic molecule
Emp. Form.:
C22H23F2N3O5
Mol. Mass.:
447.4319
SMILES:
CCOC(=O)C1C(C(C(=O)OC)=C(Cn2ccnc2)N=C1C)c1ccccc1OC(F)F
: