Target
Thromboxane-A synthase
Ligand
BDBM50368038
Substrate
Meas. Tech.
ChEBML_210101
IC50
72000±n/a nM
Citation
 Archibald, JLBradley, GOpalko, AWard, TJWhite, JCEnnis, CShepperson, NB Design of an antithrombotic-antihypertensive agent (Wy 27569). Synthesis and evaluation of a series of 2-heteroaryl-substituted dihydropyridines. J Med Chem 33:646-52 (1990)  
Target
Name:
Thromboxane-A synthase
Synonyms:
CYP5 Cytochrome P450 5A1 TBXAS1 TXA synthase TXS Thromboxane A2 Synthase (P450 TxA2) Thromboxane prostanoid Thromboxane-A synthase
Type:
Enzyme
Mol. Mass.:
60524.67
Organism:
Homo sapiens (Human)
Description:
P24557
Residue:
533
  
Inhibitor
Name:
BDBM50368038
Synonyms:
CHEMBL1203655
Type:
Small organic molecule
Emp. Form.:
C25H27N3O7
Mol. Mass.:
481.4978
SMILES:
CCOC(=O)C1=C(COCCc2ccncc2)N=C(C)C(C1c1cccc(c1)[N+]([O-])=O)C(=O)OC
: