Target
D(2) dopamine receptor
Ligand
BDBM50368065
Substrate
Meas. Tech.
ChEMBL_62709 (CHEMBL675802)
Ki
0.087000±n/a nM
Citation
 Högberg, TBengtsson, Sde Paulis, TJohansson, LStröm, PHall, HOgren, SO Potential antipsychotic agents 5. Synthesis and antidopaminergic properties of substituted 5,6-dimethoxysalicylamides and related compounds. J Med Chem 33:1155-63 (1990)  
Target
Name:
D(2) dopamine receptor
Synonyms:
DOPAMINE D2 DOPAMINE D2 Short Dopamine D2 receptor Drd2
Type:
G Protein-Coupled Receptor (GPCR)
Mol. Mass.:
50931.60
Organism:
Rattus norvegicus (rat)
Description:
P61169
Residue:
444
  
Inhibitor
Name:
BDBM50368065
Synonyms:
CHEMBL1907692
Type:
Small organic molecule
Emp. Form.:
C16H23ClN2O4
Mol. Mass.:
342.818
SMILES:
CCN1CCC[C@H]1CNC(=O)c1c(O)c(Cl)cc(OC)c1OC
: