Target
D(2) dopamine receptor
Ligand
BDBM50368069
Substrate
Meas. Tech.
ChEBML_61432
IC50
71±n/a nM
Citation
 Högberg, TBengtsson, Sde Paulis, TJohansson, LStröm, PHall, HOgren, SO Potential antipsychotic agents 5. Synthesis and antidopaminergic properties of substituted 5,6-dimethoxysalicylamides and related compounds. J Med Chem 33:1155-63 (1990)  
Target
Name:
D(2) dopamine receptor
Synonyms:
DOPAMINE D2 DOPAMINE D2 Short Dopamine D2 receptor Drd2
Type:
G Protein-Coupled Receptor (GPCR)
Mol. Mass.:
50931.60
Organism:
Rattus norvegicus (rat)
Description:
P61169
Residue:
444
  
Inhibitor
Name:
BDBM50368069
Synonyms:
CHEMBL1907698
Type:
Small organic molecule
Emp. Form.:
C16H23ClN2O4
Mol. Mass.:
342.818
SMILES:
CCN1CCC[C@H]1CNC(=O)c1c(O)c(OC)cc(Cl)c1OC
: