Target
Serine protease 1
Ligand
BDBM50368077
Substrate
Meas. Tech.
ChEBML_213083
Ki
1000±n/a nM
Citation
 Tidwell, RRJones, SKGeratz, JDOhemeng, KACory, MHall, JE Analogues of 1,5-bis(4-amidinophenoxy)pentane (pentamidine) in the treatment of experimental Pneumocystis carinii pneumonia. J Med Chem 33:1252-7 (1990)  
Target
Name:
Serine protease 1
Synonyms:
Alpha-trypsin chain 1 Beta-trypsin PRSS1 TRP1 TRY1_HUMAN Thrombin & trypsin Trypsin I | Trypsin-1
Type:
Enzyme
Mol. Mass.:
26557.80
Organism:
Homo sapiens (Human)
Description:
P07477
Residue:
247
  
Inhibitor
Name:
BDBM50368077
Synonyms:
CHEMBL3216901 | CHEMBL493336
Type:
Small organic molecule
Emp. Form.:
C19H24Cl2N6O6
Mol. Mass.:
503.336
SMILES:
Cl.Cl.NC(=N)c1ccc(OCCCCCOc2ccc(cc2[N+]([O-])=O)C(N)=N)c(c1)[N+]([O-])=O
: