Target
D(1A) dopamine receptor
Ligand
BDBM50010689
Substrate
Meas. Tech.
ChEBML_60517
IC50
120±n/a nM
Citation
 Brewster, WKNichols, DERiggs, RMMottola, DMLovenberg, TWLewis, MHMailman, RB trans-10,11-dihydroxy-5,6,6a,7,8,12b-hexahydrobenzo[a]phenanthridine: a highly potent selective dopamine D1 full agonist. J Med Chem 33:1756-64 (1990)  
Target
Name:
D(1A) dopamine receptor
Synonyms:
DOPAMINE D1 Dopamine D1 high Dopamine receptor Dopamine1-like Drd1a
Type:
Enzyme Catalytic Domain
Mol. Mass.:
49429.75
Organism:
RAT
Description:
P18901
Residue:
446
  
Inhibitor
Name:
BDBM50010689
Synonyms:
(S)-4-(4,5,6,7-Tetrahydro-thieno[2,3-c]pyridin-4-yl)-benzene-1,2-diol CHEMBL407489 SK-89626
Type:
Small organic molecule
Emp. Form.:
C13H13NO2S
Mol. Mass.:
247.313
SMILES:
Oc1ccc(cc1O)[C@@H]1CNCc2sccc12
: