Target
D(1A) dopamine receptor
Ligand
BDBM50010710
Substrate
Meas. Tech.
ChEBML_58516
Ki
1220±n/a nM
Citation
 Pettersson, ILiljefors, TBøgesø, K Conformational analysis and structure-activity relationships of selective dopamine D-1 receptor agonists and antagonists of the benzazepine series. J Med Chem 33:2197-204 (1990)  
Target
Name:
D(1A) dopamine receptor
Synonyms:
DOPAMINE D1 Dopamine D1 high Dopamine receptor Dopamine1-like Drd1a
Type:
Enzyme Catalytic Domain
Mol. Mass.:
49429.75
Organism:
RAT
Description:
P18901
Residue:
446
  
Inhibitor
Name:
BDBM50010710
Synonyms:
6-Phenyl-2,6,7,8,9,9a-hexahydro-1H-8-aza-benzo[cd]azulene-3,4-diol | CHEMBL282710
Type:
Small organic molecule
Emp. Form.:
C18H19NO2
Mol. Mass.:
281.349
SMILES:
Oc1cc2[C@H](CNC[C@@H]3CCc(c23)c1O)c1ccccc1
: