Target
Sigma non-opioid intracellular receptor 1
Ligand
BDBM50010783
Substrate
Meas. Tech.
ChEMBL_201266 (CHEMBL804883)
IC50
760±n/a nM
Citation
 Scherz, MWFialeix, MFischer, JBReddy, NLServer, ACSonders, MSTester, BCWeber, EWong, STKeana, JF Synthesis and structure-activity relationships of N,N'-di-o-tolylguanidine analogues, high-affinity ligands for the haloperidol-sensitive sigma receptor. J Med Chem 33:2421-9 (1990)  
Target
Name:
Sigma non-opioid intracellular receptor 1
Synonyms:
Aging-associated gene 8 protein SGMR1_HUMAN SIGMAR1 SR31747-binding protein Sigma 1-type opioid receptor Sigma1R | hSigmaR1
Type:
Enzyme Catalytic Domain
Mol. Mass.:
25124.85
Organism:
Homo sapiens (Human)
Description:
Q99720
Residue:
223
  
Inhibitor
Name:
BDBM50010783
Synonyms:
CHEMBL541828 | N,N'-Bis-(2-methyl-4-nitro-phenyl)-guanidine; hydrochloride
Type:
Small organic molecule
Emp. Form.:
C15H15N5O4
Mol. Mass.:
329.3107
SMILES:
Cc1cc(ccc1N\C([NH-])=[NH+]/c1ccc(cc1C)[N+]([O-])=O)[N+]([O-])=O
: