Target
Sigma non-opioid intracellular receptor 1
Ligand
BDBM50010756
Substrate
Meas. Tech.
ChEMBL_201265 (CHEMBL873129)
IC50
8±n/a nM
Citation
 Scherz, MWFialeix, MFischer, JBReddy, NLServer, ACSonders, MSTester, BCWeber, EWong, STKeana, JF Synthesis and structure-activity relationships of N,N'-di-o-tolylguanidine analogues, high-affinity ligands for the haloperidol-sensitive sigma receptor. J Med Chem 33:2421-9 (1990)  
Target
Name:
Sigma non-opioid intracellular receptor 1
Synonyms:
Aging-associated gene 8 protein SGMR1_HUMAN SIGMAR1 SR31747-binding protein Sigma 1-type opioid receptor Sigma1R | hSigmaR1
Type:
Enzyme Catalytic Domain
Mol. Mass.:
25124.85
Organism:
Homo sapiens (Human)
Description:
Q99720
Residue:
223
  
Inhibitor
Name:
BDBM50010756
Synonyms:
CHEMBL81835 | N-Adamantan-1-yl-N'-o-tolyl-guanidine
Type:
Small organic molecule
Emp. Form.:
C18H25N3
Mol. Mass.:
283.4112
SMILES:
Cc1ccccc1N=C(N)NC12CC3CC(CC(C3)C1)C2
: