Target
Sigma non-opioid intracellular receptor 1
Ligand
BDBM50010808
Substrate
Meas. Tech.
ChEBML_201720
IC50
>10000±n/a nM
Citation
 Scherz, MWFialeix, MFischer, JBReddy, NLServer, ACSonders, MSTester, BCWeber, EWong, STKeana, JF Synthesis and structure-activity relationships of N,N'-di-o-tolylguanidine analogues, high-affinity ligands for the haloperidol-sensitive sigma receptor. J Med Chem 33:2421-9 (1990)  
Target
Name:
Sigma non-opioid intracellular receptor 1
Synonyms:
Aging-associated gene 8 protein SGMR1_HUMAN SIGMAR1 SR31747-binding protein Sigma 1-type opioid receptor Sigma1R | hSigmaR1
Type:
Enzyme Catalytic Domain
Mol. Mass.:
25124.85
Organism:
Homo sapiens (Human)
Description:
Q99720
Residue:
223
  
Inhibitor
Name:
BDBM50010808
Synonyms:
CHEMBL544537 | N-[17-(1,5-Dimethyl-hexyl)-10,13-dimethyl-2,3,4,7,8,9,10,11,12,13,14,15,16,17-tetradecahydro-1H-cyclopenta[a]phenanthren-3-yl]-N'-o-tolyl-guanidine; hydrochloride
Type:
Small organic molecule
Emp. Form.:
C35H55N3
Mol. Mass.:
517.8313
SMILES:
CC(C)CCCC(C)[C@H]1CCC2C3CC=C4CC(CC[C@]4(C)C3CC[C@]12C)NC(N)=Nc1ccccc1C
: