Target
Sigma non-opioid intracellular receptor 1
Ligand
BDBM50010804
Substrate
Meas. Tech.
ChEBML_201720
IC50
340±n/a nM
Citation
 Scherz, MWFialeix, MFischer, JBReddy, NLServer, ACSonders, MSTester, BCWeber, EWong, STKeana, JF Synthesis and structure-activity relationships of N,N'-di-o-tolylguanidine analogues, high-affinity ligands for the haloperidol-sensitive sigma receptor. J Med Chem 33:2421-9 (1990)  
Target
Name:
Sigma non-opioid intracellular receptor 1
Synonyms:
Aging-associated gene 8 protein SGMR1_HUMAN SIGMAR1 SR31747-binding protein Sigma 1-type opioid receptor Sigma1R | hSigmaR1
Type:
Enzyme Catalytic Domain
Mol. Mass.:
25124.85
Organism:
Homo sapiens (Human)
Description:
Q99720
Residue:
223
  
Inhibitor
Name:
BDBM50010804
Synonyms:
1,3-Diphenyl-imidazolidin-2-ylideneamine CHEMBL82144
Type:
Small organic molecule
Emp. Form.:
C15H15N3
Mol. Mass.:
237.2997
SMILES:
N=C1N(CCN1c1ccccc1)c1ccccc1
: