Target
Mu-type opioid receptor
Ligand
BDBM50008854
Substrate
Meas. Tech.
ChEMBL_146262 (CHEMBL757486)
Ki
410±n/a nM
Citation
 Halfpenny, PRHorwell, DCHughes, JHumblet, CHunter, JCNeuhaus, DRees, DC Highly selective kappa opioid analgesics. 4. Synthesis of some conformationally restricted naphthalene derivatives with high receptor affinity and selectivity. J Med Chem 34:190-4 (1991)  
Target
Name:
Mu-type opioid receptor
Synonyms:
M-OR-1 Mu opioid receptor OPIATE Mu OPRM_CAVPO
Type:
Enzyme Catalytic Domain
Mol. Mass.:
11165.58
Organism:
GUINEA PIG
Description:
P97266
Residue:
98
  
Inhibitor
Name:
BDBM50008854
Synonyms:
2-Benzo[b]thiophen-4-yl-N-methyl-N-(2-pyrrolidin-1-yl-cyclohexyl)-acetamide; hydrochloride | CHEMBL543331
Type:
Small organic molecule
Emp. Form.:
C21H28N2OS
Mol. Mass.:
356.525
SMILES:
CN([C@H]1CCCC[C@@H]1N1CCCC1)C(=O)Cc1cccc2sccc12
: