Target
D(2) dopamine receptor
Ligand
BDBM50007425
Substrate
Meas. Tech.
ChEMBL_62424 (CHEMBL674828)
Ki
38±n/a nM
Citation
 Neumeyer, JLGao, YGKula, NSBaldessarini, RJ R and S enantiomers of 11-hydroxy- and 10,11-dihydroxy-N-allylnoraporphine: synthesis and affinity for dopamine receptors in rat brain tissue. J Med Chem 34:24-8 (1991)  
Target
Name:
D(2) dopamine receptor
Synonyms:
DOPAMINE D2 DOPAMINE D2 Short Dopamine D2 receptor Drd2
Type:
G Protein-Coupled Receptor (GPCR)
Mol. Mass.:
50931.60
Organism:
Rattus norvegicus (rat)
Description:
P61169
Residue:
444
  
Inhibitor
Name:
BDBM50007425
Synonyms:
(S) 6-Propyl-5,6,6a,7-tetrahydro-4H-dibenzo[de,g]quinoline-10,11-diol (S)-6-propyl-5,6,6a,7-tetrahydro-4H-dibenzo[de,g]quinoline-10,11-diol | CHEMBL330274
Type:
Small organic molecule
Emp. Form.:
C19H21NO2
Mol. Mass.:
295.3755
SMILES:
CCCN1CCc2cccc-3c2[C@@H]1Cc1ccc(O)c(O)c-31
: