Target
D(2) dopamine receptor
Ligand
BDBM50368144
Substrate
Meas. Tech.
ChEMBL_62424 (CHEMBL674828)
Ki
155±n/a nM
Citation
 Neumeyer, JLGao, YGKula, NSBaldessarini, RJ R and S enantiomers of 11-hydroxy- and 10,11-dihydroxy-N-allylnoraporphine: synthesis and affinity for dopamine receptors in rat brain tissue. J Med Chem 34:24-8 (1991)  
Target
Name:
D(2) dopamine receptor
Synonyms:
DOPAMINE D2 DOPAMINE D2 Short Dopamine D2 receptor Drd2
Type:
G Protein-Coupled Receptor (GPCR)
Mol. Mass.:
50931.60
Organism:
Rattus norvegicus (rat)
Description:
P61169
Residue:
444
  
Inhibitor
Name:
BDBM50368144
Synonyms:
CHEMBL1744043
Type:
Small organic molecule
Emp. Form.:
C19H19NO
Mol. Mass.:
277.3603
SMILES:
Oc1cccc2C[C@@H]3N(CC=C)CCc4cccc(c34)-c12
: