Target
D(1A) dopamine receptor
Ligand
BDBM50007428
Substrate
Meas. Tech.
ChEBML_58187
IC50
21748±n/a nM
Citation
 Jaen, JCWise, LDHeffner, TGPugsley, TAMeltzer, LT Dopamine autoreceptor agonists as potential antipsychotics. 2. (Aminoalkoxy)-4H-1-benzopyran-4-ones. J Med Chem 34:248-56 (1991)  
Target
Name:
D(1A) dopamine receptor
Synonyms:
DOPAMINE D1 Dopamine D1 high Dopamine receptor Dopamine1-like Drd1a
Type:
Enzyme Catalytic Domain
Mol. Mass.:
49429.75
Organism:
RAT
Description:
P18901
Residue:
446
  
Inhibitor
Name:
BDBM50007428
Synonyms:
7-[3-(4-Pyridin-2-yl-piperazin-1-yl)-propoxy]-chromen-4-one | CHEMBL84639
Type:
Small organic molecule
Emp. Form.:
C21H23N3O3
Mol. Mass.:
365.4256
SMILES:
O=c1ccoc2cc(OCCCN3CCN(CC3)c3ccccn3)ccc12
: