Target
D(2) dopamine receptor
Ligand
BDBM50452980
Substrate
Meas. Tech.
ChEBML_62574
Ki
21±n/a nM
Citation
 Murakami, SMarubayashi, NFukuda, TTakehara, STahara, T Antidopaminergic effects of the stereoisomers of N-[(1-alkyl-2- pyrrolidinyl)methyl]-5-sulfamoylbenzamides and -2,3-dihydrobenzofuran-7-carboxamides. J Med Chem 34:261-7 (1991)  
Target
Name:
D(2) dopamine receptor
Synonyms:
DOPAMINE D2 DOPAMINE D2 Short Dopamine D2 receptor Drd2
Type:
G Protein-Coupled Receptor (GPCR)
Mol. Mass.:
50931.60
Organism:
Rattus norvegicus (rat)
Description:
P61169
Residue:
444
  
Inhibitor
Name:
BDBM50452980
Synonyms:
CHEMBL2115232
Type:
Small organic molecule
Emp. Form.:
C17H25N3O4S
Mol. Mass.:
367.463
SMILES:
CCN1CCC[C@H]1CNC(=O)c1cc(cc2C[C@@H](C)Oc12)S(N)(=O)=O
: