Target
D(2) dopamine receptor
Ligand
BDBM81774
Substrate
Meas. Tech.
ChEBML_62574
Ki
29±n/a nM
Citation
 Murakami, SMarubayashi, NFukuda, TTakehara, STahara, T Antidopaminergic effects of the stereoisomers of N-[(1-alkyl-2- pyrrolidinyl)methyl]-5-sulfamoylbenzamides and -2,3-dihydrobenzofuran-7-carboxamides. J Med Chem 34:261-7 (1991)  
Target
Name:
D(2) dopamine receptor
Synonyms:
DOPAMINE D2 DOPAMINE D2 Short Dopamine D2 receptor Drd2
Type:
G Protein-Coupled Receptor (GPCR)
Mol. Mass.:
50931.60
Organism:
Rattus norvegicus (rat)
Description:
P61169
Residue:
444
  
Inhibitor
Name:
BDBM81774
Synonyms:
CAS_15676-16-1 Sulpiride-S | Sulpiride-l
Type:
Emp. Form.:
C15H23N3O4S
Mol. Mass.:
341.426
SMILES:
CCN1CCC[C@H]1CNC(=O)c1cc(ccc1OC)S(N)(=O)=O
: