Target
Cholecystokinin receptor type A
Ligand
BDBM50452998
Substrate
Meas. Tech.
ChEBML_50177
IC50
870±n/a nM
Citation
 Horwell, DCHughes, JHunter, JCPritchard, MCRichardson, RSRoberts, EWoodruff, GN Rationally designed"dipeptoid" analogues of CCK. alpha-Methyltryptophan derivatives as highly selective and orally active gastrin and CCK-B antagonists with potent anxiolytic properties. J Med Chem 34:404-14 (1991)  
Target
Name:
Cholecystokinin receptor type A
Synonyms:
CCKAR_RAT Cholecystokinin peripheral Cholecystokinin receptor type A
Type:
Enzyme Catalytic Domain
Mol. Mass.:
49676.37
Organism:
RAT
Description:
Cholecystokinin central 0 RAT::P30551
Residue:
444
  
Inhibitor
Name:
BDBM50452998
Synonyms:
CHEMBL2112693
Type:
Small organic molecule
Emp. Form.:
C34H42N4O7
Mol. Mass.:
618.7199
SMILES:
O.[H][C@@](CNC(=O)[C@@](C)(Cc1c[nH]c2ccccc12)NC(=O)OC1[C@@]2([H])C[C@]3([H])C[C@@]([H])(C[C@@]1([H])C3)C2)(NC(=O)CC(O)=O)c1ccccc1
: