Target
3-hydroxy-3-methylglutaryl-coenzyme A reductase
Ligand
BDBM50007254
Substrate
Meas. Tech.
ChEBML_78556
IC50
>5000±n/a nM
Citation
 Jendralla, HGranzer, Evon Kerekjarto, BKrause, RSchacht, UBaader, EBartmann, WBeck, GBergmann, AKesseler, K Synthesis and biological activity of new HMG-CoA reductase inhibitors. 3. Lactones of 6-phenoxy-3,5-dihydroxyhexanoic acids. J Med Chem 34:2962-83 (1991)  
Target
Name:
3-hydroxy-3-methylglutaryl-coenzyme A reductase
Synonyms:
3-hydroxy-3-methylglutaryl-coenzyme A (HMG-CoA) reductase HMDH_HUMAN HMG-CoA reductase (HMGR) | HMGCR
Type:
Enzyme
Mol. Mass.:
97477.10
Organism:
Homo sapiens (Human)
Description:
P04035
Residue:
888
  
Inhibitor
Name:
BDBM50007254
Synonyms:
CHEMBL103139 | Sodium; 6-[2-(4-fluoro-phenyl)-4-methyl-quinolin-3-yloxy]-3,5-dihydroxy-hexanoate
Type:
Small organic molecule
Emp. Form.:
C22H21FNO5
Mol. Mass.:
398.4048
SMILES:
Cc1c(OCC(O)C[C@@H](O)CC([O-])=O)c(nc2ccccc12)-c1ccc(F)cc1
: