Target
3-hydroxy-3-methylglutaryl-coenzyme A reductase
Ligand
BDBM50007267
Substrate
Meas. Tech.
ChEBML_78556
IC50
5.6±n/a nM
Citation
 Jendralla, HGranzer, Evon Kerekjarto, BKrause, RSchacht, UBaader, EBartmann, WBeck, GBergmann, AKesseler, K Synthesis and biological activity of new HMG-CoA reductase inhibitors. 3. Lactones of 6-phenoxy-3,5-dihydroxyhexanoic acids. J Med Chem 34:2962-83 (1991)  
Target
Name:
3-hydroxy-3-methylglutaryl-coenzyme A reductase
Synonyms:
3-hydroxy-3-methylglutaryl-coenzyme A (HMG-CoA) reductase HMDH_HUMAN HMG-CoA reductase (HMGR) | HMGCR
Type:
Enzyme
Mol. Mass.:
97477.10
Organism:
Homo sapiens (Human)
Description:
P04035
Residue:
888
  
Inhibitor
Name:
BDBM50007267
Synonyms:
CHEMBL321768 | Sodium; 6-(4'-fluoro-5-hydroxy-3,4,6-triisopropyl-biphenyl-2-yloxy)-3,5-dihydroxy-hexanoate
Type:
Small organic molecule
Emp. Form.:
C27H36FO6
Mol. Mass.:
475.5701
SMILES:
CC(C)c1c(O)c(C(C)C)c(-c2ccc(F)cc2)c(OCC(O)C[C@@H](O)CC([O-])=O)c1C(C)C
: