Target
3-hydroxy-3-methylglutaryl-coenzyme A reductase
Ligand
BDBM50007272
Substrate
Meas. Tech.
ChEBML_80660
IC50
6±n/a nM
Citation
 Jendralla, HGranzer, Evon Kerekjarto, BKrause, RSchacht, UBaader, EBartmann, WBeck, GBergmann, AKesseler, K Synthesis and biological activity of new HMG-CoA reductase inhibitors. 3. Lactones of 6-phenoxy-3,5-dihydroxyhexanoic acids. J Med Chem 34:2962-83 (1991)  
Target
Name:
3-hydroxy-3-methylglutaryl-coenzyme A reductase
Synonyms:
HMDH_RAT Hmgcr
Type:
Enzyme
Mol. Mass.:
96689.85
Organism:
Rattus norvegicus (rat)
Description:
Isolated rat liver microsomes were used as enzyme source.
Residue:
887
  
Inhibitor
Name:
BDBM50007272
Synonyms:
CHEMBL102168 | Sodium; 6-[4'-fluoro-5-(4-fluoro-phenylsulfanyl)-3-isopropyl-biphenyl-2-yloxy]-3,5-dihydroxy-hexanoate
Type:
Small organic molecule
Emp. Form.:
C27H27F2O5S
Mol. Mass.:
501.563
SMILES:
CC(C)c1cc(Sc2ccc(F)cc2)cc(-c2ccc(F)cc2)c1OCC(O)C[C@@H](O)CC([O-])=O
: