Target
3-hydroxy-3-methylglutaryl-coenzyme A reductase
Ligand
BDBM50007274
Substrate
Meas. Tech.
ChEBML_78556
IC50
>1700±n/a nM
Citation
 Jendralla, HGranzer, Evon Kerekjarto, BKrause, RSchacht, UBaader, EBartmann, WBeck, GBergmann, AKesseler, K Synthesis and biological activity of new HMG-CoA reductase inhibitors. 3. Lactones of 6-phenoxy-3,5-dihydroxyhexanoic acids. J Med Chem 34:2962-83 (1991)  
Target
Name:
3-hydroxy-3-methylglutaryl-coenzyme A reductase
Synonyms:
3-hydroxy-3-methylglutaryl-coenzyme A (HMG-CoA) reductase HMDH_HUMAN HMG-CoA reductase (HMGR) | HMGCR
Type:
Enzyme
Mol. Mass.:
97477.10
Organism:
Homo sapiens (Human)
Description:
P04035
Residue:
888
  
Inhibitor
Name:
BDBM50007274
Synonyms:
CHEMBL101831 | Disodiumsalt;6-{4'-Fluoro-5-[1-(4'-fluoro-6-hydroxy-5-isopropyl-biphenyl-3-ylsulfanyl)-1-methyl-ethylsulfanyl]-3-isopropyl-biphenyl-2-yloxy}-3,5-dihydroxy-hexanoic acid
Type:
Small organic molecule
Emp. Form.:
C39H42F2O6S2
Mol. Mass.:
708.875
SMILES:
CC(C)c1cc(SC(C)(C)Sc2cc(C(C)C)c(OCC(O)C[C@@H](O)CC([O-])=O)c(c2)-c2ccc(F)cc2)cc(c1[O-])-c1ccc(F)cc1
: