Target
3-hydroxy-3-methylglutaryl-coenzyme A reductase
Ligand
BDBM50007291
Substrate
Meas. Tech.
ChEBML_78556
IC50
2500±n/a nM
Citation
 Jendralla, HGranzer, Evon Kerekjarto, BKrause, RSchacht, UBaader, EBartmann, WBeck, GBergmann, AKesseler, K Synthesis and biological activity of new HMG-CoA reductase inhibitors. 3. Lactones of 6-phenoxy-3,5-dihydroxyhexanoic acids. J Med Chem 34:2962-83 (1991)  
Target
Name:
3-hydroxy-3-methylglutaryl-coenzyme A reductase
Synonyms:
3-hydroxy-3-methylglutaryl-coenzyme A (HMG-CoA) reductase HMDH_HUMAN HMG-CoA reductase (HMGR) | HMGCR
Type:
Enzyme
Mol. Mass.:
97477.10
Organism:
Homo sapiens (Human)
Description:
P04035
Residue:
888
  
Inhibitor
Name:
BDBM50007291
Synonyms:
CHEMBL321713 | Sodium; 6-[2,4-dichloro-6-(cyclohexyl-difluoro-methyl)-phenoxy]-3,5-dihydroxy-hexanoate
Type:
Small organic molecule
Emp. Form.:
C19H23Cl2F2O5
Mol. Mass.:
440.286
SMILES:
OC(COc1c(Cl)cc(Cl)cc1C(F)(F)C1CCCCC1)C[C@@H](O)CC([O-])=O
: