Target
3-hydroxy-3-methylglutaryl-coenzyme A reductase
Ligand
BDBM50007307
Substrate
Meas. Tech.
ChEBML_80660
IC50
190±n/a nM
Citation
 Jendralla, HGranzer, Evon Kerekjarto, BKrause, RSchacht, UBaader, EBartmann, WBeck, GBergmann, AKesseler, K Synthesis and biological activity of new HMG-CoA reductase inhibitors. 3. Lactones of 6-phenoxy-3,5-dihydroxyhexanoic acids. J Med Chem 34:2962-83 (1991)  
Target
Name:
3-hydroxy-3-methylglutaryl-coenzyme A reductase
Synonyms:
HMDH_RAT Hmgcr
Type:
Enzyme
Mol. Mass.:
96689.85
Organism:
Rattus norvegicus (rat)
Description:
Isolated rat liver microsomes were used as enzyme source.
Residue:
887
  
Inhibitor
Name:
BDBM50007307
Synonyms:
CHEMBL101806 | Sodium; 6-(2,4-dichloro-6-cyclohexanecarbonyl-phenoxy)-3,5-dihydroxy-hexanoate
Type:
Small organic molecule
Emp. Form.:
C19H23Cl2O6
Mol. Mass.:
418.289
SMILES:
OC(COc1c(Cl)cc(Cl)cc1C(=O)C1CCCCC1)C[C@@H](O)CC([O-])=O
: