Target
Muscarinic acetylcholine receptor M1
Ligand
BDBM73402
Substrate
Meas. Tech.
ChEBML_139068
Ki
1.2±n/a nM
Citation
 Hudkins, RLDeHaven-Hudkins, DLStubbins, JF Muscarinic receptor binding profile of para-substituted caramiphen analogues. J Med Chem 34:2984-9 (1991)  
Target
Name:
Muscarinic acetylcholine receptor M1
Synonyms:
ACM1_RAT Chrm-1 cholinergic receptor, muscarinic 1
Type:
Enzyme Catalytic Domain
Mol. Mass.:
51390.46
Organism:
RAT
Description:
P08482
Residue:
460
  
Inhibitor
Name:
BDBM73402
Synonyms:
1-Phenyl-cyclopentanecarboxylic acid 2-diethylamino-ethyl ester 1-phenylcyclopentanecarboxylic acid 2-(diethylamino)ethyl ester;hydrochloride 2-(diethylamino)ethyl 1-phenylcyclopentanecarboxylate hydrochloride CHEMBL61946 SMR000140237 | cid_67173
Type:
Small organic molecule
Emp. Form.:
C18H27NO2
Mol. Mass.:
289.4125
SMILES:
CCN(CC)CCOC(=O)C1(CCCC1)c1ccccc1
: