Target
Sodium-dependent dopamine transporter
Ligand
BDBM50010195
Substrate
Meas. Tech.
ChEBML_61489
IC50
88±n/a nM
Citation
 Neumeyer, JLWang, SYMilius, RABaldwin, RMZea-Ponce, YHoffer, PBSybirska, Eal-Tikriti, MCharney, DSMalison, RT [123I]-2 beta-carbomethoxy-3 beta-(4-iodophenyl)tropane: high-affinity SPECT radiotracer of monoamine reuptake sites in brain. J Med Chem 34:3144-6 (1991)  
Target
Name:
Sodium-dependent dopamine transporter
Synonyms:
DA transporter SC6A3_RAT Sodium-dependent dopamine transporter | Sodium-dependent dopamine transporter (DAT)
Type:
Multi-pass membrane protein
Mol. Mass.:
68749.45
Organism:
Rattus norvegicus (rat)
Description:
P23977
Residue:
619
  
Inhibitor
Name:
BDBM50010195
Synonyms:
(3S,5R)-methyl 3-(4-iodophenyl)-8-methyl-8-aza-bicyclo[3.2.1]octane-2-carboxylate 3-(4-Iodo-phenyl)-8-methyl-8-aza-bicyclo[3.2.1]octane-2-carboxylic acid methyl ester | CHEMBL14391
Type:
Small organic molecule
Emp. Form.:
C16H20INO2
Mol. Mass.:
385.24
SMILES:
COC(=O)C1C2CCC(CC1c1ccc(I)cc1)N2C
: