Target
Kappa-type opioid receptor
Ligand
BDBM50007359
Substrate
Meas. Tech.
ChEMBL_145202 (CHEMBL753519)
IC50
99±n/a nM
Citation
 Barlow, JJBlackburn, TPCostello, GFJames, RLe Count, DJMain, BGPearce, RJRussell, KShaw, JS Structure/activity studies related to 2-(3,4-dichlorophenyl)-N-methyl-N-[2-(1-pyrrolidinyl)-1-substituted- ethyl]acetamides: a novel series of potent and selective kappa-opioid agonists. J Med Chem 34:3149-58 (1991)  
Target
Name:
Kappa-type opioid receptor
Synonyms:
Kappa Opioid Receptor OPRK1 Opiate Kappa 1 | mu/kappa opioid receptor
Type:
G Protein-Coupled Receptor (GPCR)
Mol. Mass.:
42744.99
Organism:
Cavia porcellus (domestic guinea pig)
Description:
P41144
Residue:
380
  
Inhibitor
Name:
BDBM50007359
Synonyms:
2-(3-Chloro-phenyl)-N-methyl-N-(2-methyl-1-pyrrolidin-1-ylmethyl-propyl)-acetamide | CHEMBL106510
Type:
Small organic molecule
Emp. Form.:
C18H27ClN2O
Mol. Mass.:
322.873
SMILES:
CC(C)[C@@H](CN1CCCC1)N(C)C(=O)Cc1cccc(Cl)c1
: