Target
Kappa-type opioid receptor
Ligand
BDBM50281663
Substrate
Meas. Tech.
ChEBML_145801
IC50
29±n/a nM
Citation
 Barlow, JJBlackburn, TPCostello, GFJames, RLe Count, DJMain, BGPearce, RJRussell, KShaw, JS Structure/activity studies related to 2-(3,4-dichlorophenyl)-N-methyl-N-[2-(1-pyrrolidinyl)-1-substituted- ethyl]acetamides: a novel series of potent and selective kappa-opioid agonists. J Med Chem 34:3149-58 (1991)  
Target
Name:
Kappa-type opioid receptor
Synonyms:
Kappa Opioid Receptor OPRK1 Opiate Kappa 1 | mu/kappa opioid receptor
Type:
G Protein-Coupled Receptor (GPCR)
Mol. Mass.:
42744.99
Organism:
Cavia porcellus (domestic guinea pig)
Description:
P41144
Residue:
380
  
Inhibitor
Name:
BDBM50281663
Synonyms:
10-cyclopropylmethyl-1-ethyl-4-hydroxy-13-methyl-(1R,9S,13R)-10-azatricyclo[7.3.1.02,7]trideca-2(7),3,5-trien-8-one CHEMBL422551
Type:
Small organic molecule
Emp. Form.:
C19H25NO2
Mol. Mass.:
299.4073
SMILES:
CC[C@]12CCN(CC3CC3)[C@@H]([C@@H]1C)C(=O)c1ccc(O)cc21
: