Target
Muscarinic acetylcholine receptor M1/M2/M3/M4/M5
Ligand
BDBM50011851
Substrate
Meas. Tech.
ChEMBL_70873 (CHEMBL684531)
Kd
0.034674±n/a nM
Citation
 Triggle, DJKwon, YWAbraham, PPitner, JBMascarella, SWCarroll, FI Synthesis, molecular modeling studies, and muscarinic receptor activity of azaprophen analogues. J Med Chem 34:3164-71 (1991)  
Target
Name:
Muscarinic acetylcholine receptor M1/M2/M3/M4/M5
Synonyms:
Muscarinic acetylcholine receptor
Type:
Mol. Mass.:
Description:
ASSAY_ID of ChEMBL is 329940
Components:
This complex has 5 components.
Component 1
Name:
Muscarinic acetylcholine receptor M2
Synonyms:
ACM2_HUMAN Cholinergic, muscarinic M2 Muscarinic acetylcholine receptor M2 and M5 | RecName: Full=Muscarinic acetylcholine receptor M2
Type:
GPCR
Mol. Mass.:
51730.61
Organism:
Homo sapiens (Human)
Description:
P08172
Residue:
466
  
Component 2
Name:
Muscarinic acetylcholine receptor M3
Synonyms:
ACM3_HUMAN Cholinergic, muscarinic M3 Muscarinic receptor M3 | RecName: Full=Muscarinic acetylcholine receptor M3
Type:
Enzyme
Mol. Mass.:
66151.03
Organism:
Homo sapiens (Human)
Description:
P20309
Residue:
590
  
Component 3
Name:
Muscarinic acetylcholine receptor M5
Synonyms:
ACM5_HUMAN | CHRM5
Type:
PROTEIN
Mol. Mass.:
60102.35
Organism:
Homo sapiens (Human)
Description:
ChEMBL_1517990
Residue:
532
  
Component 4
Name:
Muscarinic acetylcholine receptor M1
Synonyms:
ACM1_HUMAN Cholinergic receptor, muscarinic 1 | Cholinergic, muscarinic M1
Type:
Protein
Mol. Mass.:
51442.54
Organism:
Homo sapiens (Human)
Description:
P11229
Residue:
460
  
Component 5
Name:
Muscarinic acetylcholine receptor M4
Synonyms:
ACM4_HUMAN Cholinergic, muscarinic M4 Muscarinic acetylcholine receptor M2 and M4
Type:
Enzyme Catalytic Domain
Mol. Mass.:
53079.31
Organism:
Homo sapiens (Human)
Description:
Cholinergic, muscarinic M4 CHRM4 HUMAN M3::P08173
Residue:
479
  
Inhibitor
Name:
BDBM50011851
Synonyms:
2,2-Diphenyl-propionic acid 6-methyl-6-aza-bicyclo[3.2.1]oct-3-yl ester CHEMBL287868
Type:
Small organic molecule
Emp. Form.:
C23H27NO2
Mol. Mass.:
349.466
SMILES:
CN1CC2CC1CC(C2)OC(=O)C(C)(c1ccccc1)c1ccccc1
: