Target
Muscarinic acetylcholine receptor M3
Ligand
BDBM50368150
Substrate
Meas. Tech.
ChEBML_138980
Ki
11±n/a nM
Citation
 Triggle, DJKwon, YWAbraham, PPitner, JBMascarella, SWCarroll, FI Synthesis, molecular modeling studies, and muscarinic receptor activity of azaprophen analogues. J Med Chem 34:3164-71 (1991)  
Target
Name:
Muscarinic acetylcholine receptor M3
Synonyms:
ACM3_RAT Chrm-3 | Chrm3
Type:
Enzyme Catalytic Domain
Mol. Mass.:
66086.66
Organism:
RAT
Description:
Cholinergic, muscarinic M3 CHRM3 RAT::P08483
Residue:
589
  
Inhibitor
Name:
BDBM50368150
Synonyms:
CHEMBL326640
Type:
Small organic molecule
Emp. Form.:
C22H25NO2
Mol. Mass.:
335.4394
SMILES:
CN1CC2CC1CC(C2)OC(=O)C(c1ccccc1)c1ccccc1
: