Target
Aldo-keto reductase family 1 member B1
Ligand
BDBM50010281
Substrate
Meas. Tech.
ChEMBL_92451 (CHEMBL878705)
IC50
27±n/a nM
Citation
 DuPriest, MTGriffin, BWKuzmich, DMcNatt, LG Spiro[fluoreneisothiazolidin]one dioxides: new aldose reductase and L-hexonate dehydrogenase inhibitors. J Med Chem 34:3229-34 (1991)  
Target
Name:
Aldo-keto reductase family 1 member B1
Synonyms:
ALDR_RAT Akr1b4 Aldr1
Type:
PROTEIN
Mol. Mass.:
35797.87
Organism:
Rattus norvegicus
Description:
ChEMBL_1512484
Residue:
316
  
Inhibitor
Name:
BDBM50010281
Synonyms:
2,7-Difluorospiro[9H-fluorene-9,5'-isothiazolidin]-3'-one 1',1'-Dioxide | CHEMBL327139
Type:
Small organic molecule
Emp. Form.:
C15H9F2NO3S
Mol. Mass.:
321.299
SMILES:
Fc1ccc2-c3ccc(F)cc3C3(CC(=O)NS3(=O)=O)c2c1
: