Target
Renin
Ligand
BDBM50010408
Substrate
Meas. Tech.
ChEBML_195762
IC50
0.760000±n/a nM
Citation
 Raddatz, PJonczyk, AMinck, KOSchmitges, CJSombroek, J Substrate analogue renin inhibitors containing replacements of histidine in P2 or isosteres of the amide bond between P3 and P2 sites. J Med Chem 34:3267-80 (1991)  
Target
Name:
Renin
Synonyms:
Angiotensinogenase RENI_HUMAN
Type:
Enzyme
Mol. Mass.:
45058.99
Organism:
Homo sapiens (Human)
Description:
Residue:
406
  
Inhibitor
Name:
BDBM50010408
Synonyms:
4-Amino-piperidine-1-carboxylic acid {1-[2-(3-{1-[(4-amino-2-methyl-pyrimidin-5-ylmethyl)-carbamoyl]-2-methyl-butylcarbamoyl}-1-cyclohexylmethyl-2-hydroxy-propylcarbamoyl)-ethylcarbamoyl]-2-phenyl-ethyl}-amide: dihydrochloride | CHEMBL540047
Type:
Small organic molecule
Emp. Form.:
C41H64N10O6
Mol. Mass.:
793.0103
SMILES:
CC[C@H](C)[C@H](NC(=O)C[C@H](O)[C@H](CC1CCCCC1)NC(=O)CCNC(=O)[C@H](Cc1ccccc1)NC(=O)N1CCC(N)CC1)C(=O)NCc1cnc(C)nc1N
: