Target
Renin
Ligand
BDBM50010417
Substrate
Meas. Tech.
ChEBML_195762
IC50
4.1±n/a nM
Citation
 Raddatz, PJonczyk, AMinck, KOSchmitges, CJSombroek, J Substrate analogue renin inhibitors containing replacements of histidine in P2 or isosteres of the amide bond between P3 and P2 sites. J Med Chem 34:3267-80 (1991)  
Target
Name:
Renin
Synonyms:
Angiotensinogenase RENI_HUMAN
Type:
Enzyme
Mol. Mass.:
45058.99
Organism:
Homo sapiens (Human)
Description:
Residue:
406
  
Inhibitor
Name:
BDBM50010417
Synonyms:
BOC-Phe-beta-Ala-Leu-psi[CHOHCH2]Val-Ile N-[(4-amino-2-methyl-5-pyrimidinyl)methyl]amide | CHEMBL111515
Type:
Small organic molecule
Emp. Form.:
C41H66N8O7
Mol. Mass.:
783.0121
SMILES:
CC[C@H](C)[C@H](NC(=O)[C@@H](C[C@H](O)[C@H](CC(C)C)NC(=O)CCNC(=O)[C@H](Cc1ccccc1)NC(=O)OC(C)(C)C)C(C)C)C(=O)NCc1cnc(C)nc1N
: