Target
Cathepsin D
Ligand
BDBM50010419
Substrate
Meas. Tech.
ChEBML_216563
IC50
10000±n/a nM
Citation
 Raddatz, PJonczyk, AMinck, KOSchmitges, CJSombroek, J Substrate analogue renin inhibitors containing replacements of histidine in P2 or isosteres of the amide bond between P3 and P2 sites. J Med Chem 34:3267-80 (1991)  
Target
Name:
Cathepsin D
Synonyms:
CATD_BOVIN | CTSD
Type:
PROTEIN
Mol. Mass.:
42158.92
Organism:
Bos taurus
Description:
ChEMBL_1458606
Residue:
387
  
Inhibitor
Name:
BDBM50010419
Synonyms:
4-Dimethylamino-piperidine-1-carboxylic acid {1-[2-(3-{1-[(4-amino-2-methyl-pyrimidin-5-ylmethyl)-carbamoyl]-2-methyl-butylcarbamoyl}-1-cyclohexylmethyl-2-hydroxy-propylcarbamoyl)-ethylcarbamoyl]-2-phenyl-ethyl}-amide | CHEMBL111144
Type:
Small organic molecule
Emp. Form.:
C43H68N10O6
Mol. Mass.:
821.0634
SMILES:
CC[C@H](C)[C@H](NC(=O)C[C@H](O)[C@H](CC1CCCCC1)NC(=O)CCNC(=O)[C@H](Cc1ccccc1)NC(=O)N1CCC(CC1)N(C)C)C(=O)NCc1cnc(C)nc1N
: